Android Studio 0.5.2 Gradle Refresh Project gescheitert

? Adrian Olar @ | Original: StackOverFlow
---

AKTUALISIERT MIT MEINEM EREIG.PROTOKOLL

Letzte Änderung Nach dem Ausprobieren jede mögliche Lösung könnte ich finde, ich habe auf eine frische Installation von Windows zu kommen. Dabei bemerkte ich, dass dies ein Firewall-Problem indeeed, meine Antiviren blockierte die studio64.exe process.

Ich habe frisch Android Studio 0.4.2 dann sofort auf 0.5.2 aktualisiert, ohne Öffnen oder Erstellen neue Projekte installiert .

Ich aktualisiert das Android SDK erstellt dann ein neues Projekt. Ich erhalte den Fehler mit der Gradle Aktualisierung fehlgeschlagen, obwohl ich versuchte, die lokalen gradle Verteilung ändern, nichts scheint zu arbeiten, alles, was ich versuche Gradle antwortet mit : " Bitte korrigieren Sie Ihre Gradle Konfiguration " ...

Dies war mit mir geschehen, seit ich auf Android Studio 5.1 aktualisiert, noch nie.

Ich habe versucht, mit Gradle 1.10 und 1.11 und die Gradle Wrapper im Kit zum Herunterladen von der Website installieren inbegriffen http://developer.android.com/sdk/installing/studio.html

Hier sind meine gradle Dateien :

apply plugin: 'android'

android {
    compileSdkVersion 19
    buildToolsVersion "19.0.3"

    defaultConfig {
        minSdkVersion 8
        targetSdkVersion 19
        versionCode 1
        versionName "1.0"
    }
    buildTypes {
        release {
            runProguard false
            proguardFiles getDefaultProguardFile('proguard-android.txt'), 'proguard-rules.txt'
        }
    }
}

dependencies {
    compile 'com.android.support:appcompat-v7:+'
    compile fileTree(dir: 'libs', include: ['*.jar'])
}

Und die Außen build.gradle Datei.

// Top-level build file where you can add configuration options common to all sub-projects/modules.

buildscript {
    repositories {
        mavenCentral()
    }
    dependencies {
        classpath 'com.android.tools.build:gradle:0.9.+'
    }
}

allprojects {
    repositories {
        mavenCentral()
    }
}

Jetzt habe ich versucht den Download der neuesten Version von der Canary Körperbau und dann das Herunterladen des SDK sepparately, immer noch das gleiche Problem, das ist wirklich ärgerlich, ... Gibt es eine Netzwerkeinstellung i könnten mit Setup falsch ?

Derzeit bin ich mit den Standard Grale Wrapper von Android Studio, und das ist der Fehler bekomme ich :

10:58:37 AM Gradle 'ClujTourist' project refresh failed:
            A fatal exception has occurred. Program will exit.
            : Gradle settings

Nach dem Versuch, das Projekt mit kompilieren: gradlew.bat --stacktrace assemble

das ist, was ich habe :

C:UsersAdrian-PCAndroidStudioProjectsClujTourist>gradlew.bat --stacktrace as
semble

FAILURE: Build failed with an exception.

* What went wrong:
A problem occurred configuring root project 'ClujTourist'.
> Could not resolve all dependencies for configuration ':classpath'.
   > Could not find any version that matches com.android.tools.build:gradle:0.11
.+.
     Required by:
         :ClujTourist:unspecified

* Try:
Run with --info or --debug option to get more log output.

* Exception is:
org.gradle.api.ProjectConfigurationException: A problem occurred configuring roo
t project 'ClujTourist'.
        at org.gradle.configuration.project.LifecycleProjectEvaluator.addConfigu
rationFailure(LifecycleProjectEvaluator.java:79)
        at org.gradle.configuration.project.LifecycleProjectEvaluator.evaluate(L
ifecycleProjectEvaluator.java:57)
        at org.gradle.api.internal.project.AbstractProject.evaluate(AbstractProj
ect.java:507)
        at org.gradle.api.internal.project.AbstractProject.evaluate(AbstractProj
ect.java:82)
        at org.gradle.configuration.DefaultBuildConfigurer.configure(DefaultBuil
dConfigurer.java:31)
        at org.gradle.initialization.DefaultGradleLauncher.doBuildStages(Default
GradleLauncher.java:142)
        at org.gradle.initialization.DefaultGradleLauncher.doBuild(DefaultGradle
Launcher.java:113)
        at org.gradle.initialization.DefaultGradleLauncher.run(DefaultGradleLaun
cher.java:81)
        at org.gradle.launcher.exec.InProcessBuildActionExecuter$DefaultBuildCon
troller.run(InProcessBuildActionExecuter.java:64)
        at org.gradle.launcher.cli.ExecuteBuildAction.run(ExecuteBuildAction.jav
a:33)
        at org.gradle.launcher.cli.ExecuteBuildAction.run(ExecuteBuildAction.jav
a:24)
        at org.gradle.launcher.exec.InProcessBuildActionExecuter.execute(InProce
ssBuildActionExecuter.java:35)
        at org.gradle.launcher.exec.InProcessBuildActionExecuter.execute(InProce
ssBuildActionExecuter.java:26)
        at org.gradle.launcher.cli.RunBuildAction.run(RunBuildAction.java:50)
        at org.gradle.internal.Actions$RunnableActionAdapter.execute(Actions.jav
a:171)
        at org.gradle.launcher.cli.CommandLineActionFactory$ParseAndBuildAction.
execute(CommandLineActionFactory.java:201)
        at org.gradle.launcher.cli.CommandLineActionFactory$ParseAndBuildAction.
execute(CommandLineActionFactory.java:174)
        at org.gradle.launcher.cli.CommandLineActionFactory$WithLogging.execute(
CommandLineActionFactory.java:170)
        at org.gradle.launcher.cli.CommandLineActionFactory$WithLogging.execute(
CommandLineActionFactory.java:139)
        at org.gradle.launcher.cli.ExceptionReportingAction.execute(ExceptionRep
ortingAction.java:33)
        at org.gradle.launcher.cli.ExceptionReportingAction.execute(ExceptionRep
ortingAction.java:22)
        at org.gradle.launcher.Main.doAction(Main.java:46)
        at org.gradle.launcher.bootstrap.EntryPoint.run(EntryPoint.java:45)
        at org.gradle.launcher.Main.main(Main.java:37)
        at org.gradle.launcher.bootstrap.ProcessBootstrap.runNoExit(ProcessBoots
trap.java:50)
        at org.gradle.launcher.bootstrap.ProcessBootstrap.run(ProcessBootstrap.j
ava:32)
        at org.gradle.launcher.GradleMain.main(GradleMain.java:23)
        at org.gradle.wrapper.BootstrapMainStarter.start(BootstrapMainStarter.ja
va:33)
        at org.gradle.wrapper.WrapperExecutor.execute(WrapperExecutor.java:130)
        at org.gradle.wrapper.GradleWrapperMain.main(GradleWrapperMain.java:48)
Caused by: org.gradle.api.artifacts.ResolveException: Could not resolve all depe
ndencies for configuration ':classpath'.
        at org.gradle.api.internal.artifacts.ivyservice.DefaultLenientConfigurat
ion.rethrowFailure(DefaultLenientConfiguration.java:52)
        at org.gradle.api.internal.artifacts.ivyservice.DefaultResolvedConfigura
tion.rethrowFailure(DefaultResolvedConfiguration.java:36)
        at org.gradle.api.internal.artifacts.ivyservice.SelfResolvingDependencyR
esolver$FilesAggregatingResolvedConfiguration.rethrowFailure(SelfResolvingDepend
encyResolver.java:106)
        at org.gradle.api.internal.artifacts.ivyservice.ErrorHandlingArtifactDep
endencyResolver$ErrorHandlingResolvedConfiguration.rethrowFailure(ErrorHandlingA
rtifactDependencyResolver.java:176)
        at org.gradle.api.internal.artifacts.configurations.DefaultConfiguration
$ConfigurationFileCollection.getFiles(DefaultConfiguration.java:465)
        at org.gradle.api.internal.artifacts.configurations.DefaultConfiguration
.getFiles(DefaultConfiguration.java:202)
        at org.gradle.api.internal.artifacts.configurations.DefaultConfiguration
_Decorated.getFiles(Unknown Source)
        at org.gradle.api.internal.initialization.DefaultScriptHandler.updateCla
ssPath(DefaultScriptHandler.java:75)
        at org.gradle.configuration.DefaultScriptPluginFactory$ScriptPluginImpl.
apply(DefaultScriptPluginFactory.java:145)
        at org.gradle.configuration.project.BuildScriptProcessor.execute(BuildSc
riptProcessor.java:38)
        at org.gradle.configuration.project.BuildScriptProcessor.execute(BuildSc
riptProcessor.java:25)
        at org.gradle.configuration.project.ConfigureActionsProjectEvaluator.eva
luate(ConfigureActionsProjectEvaluator.java:34)
        at org.gradle.configuration.project.LifecycleProjectEvaluator.evaluate(L
ifecycleProjectEvaluator.java:55)
        ... 28 more
Caused by: org.gradle.api.internal.artifacts.ivyservice.ModuleVersionNotFoundExc
eption: Could not find any version that matches com.android.tools.build:gradle:0
.11.+.
Required by:
    :ClujTourist:unspecified
        at org.gradle.api.internal.artifacts.ivyservice.ivyresolve.LazyDependenc
yToModuleResolver$DynamicVersionResolveResult.notFound(LazyDependencyToModuleRes
olver.java:170)
        at org.gradle.api.internal.artifacts.ivyservice.ivyresolve.LazyDependenc
yToModuleResolver$AbstractVersionResolveResult.resolve(LazyDependencyToModuleRes
olver.java:91)
        at org.gradle.api.internal.artifacts.ivyservice.ivyresolve.LazyDependenc
yToModuleResolver.resolve(LazyDependencyToModuleResolver.java:47)
        at org.gradle.api.internal.artifacts.ivyservice.VersionForcingDependency
ToModuleResolver.resolve(VersionForcingDependencyToModuleResolver.java:48)
        at org.gradle.api.internal.artifacts.ivyservice.resolveengine.Dependency
GraphBuilder$ModuleVersionSelectorResolveState.resolveModuleRevisionId(Dependenc
yGraphBuilder.java:935)
        at org.gradle.api.internal.artifacts.ivyservice.resolveengine.Dependency
GraphBuilder$DependencyEdge.resolveModuleRevisionId(DependencyGraphBuilder.java:
296)
        at org.gradle.api.internal.artifacts.ivyservice.resolveengine.Dependency
GraphBuilder.traverseGraph(DependencyGraphBuilder.java:93)
        at org.gradle.api.internal.artifacts.ivyservice.resolveengine.Dependency
GraphBuilder.resolve(DependencyGraphBuilder.java:66)
        at org.gradle.api.internal.artifacts.ivyservice.resolveengine.DefaultDep
endencyResolver$1.transform(DefaultDependencyResolver.java:108)
        at org.gradle.api.internal.artifacts.ivyservice.resolveengine.DefaultDep
endencyResolver$1.transform(DefaultDependencyResolver.java:77)
        at org.gradle.api.internal.artifacts.ivyservice.DefaultIvyContextManager
.withIvy(DefaultIvyContextManager.java:61)
        at org.gradle.api.internal.artifacts.ivyservice.resolveengine.DefaultDep
endencyResolver.resolve(DefaultDependencyResolver.java:77)
        at org.gradle.api.internal.artifacts.ivyservice.CacheLockingArtifactDepe
ndencyResolver$1.create(CacheLockingArtifactDependencyResolver.java:39)
        at org.gradle.api.internal.artifacts.ivyservice.CacheLockingArtifactDepe
ndencyResolver$1.create(CacheLockingArtifactDependencyResolver.java:37)
        at org.gradle.cache.internal.DefaultCacheAccess.useCache(DefaultCacheAcc
ess.java:148)
        at org.gradle.cache.internal.DefaultPersistentDirectoryStore.useCache(De
faultPersistentDirectoryStore.java:123)
        at org.gradle.api.internal.artifacts.ivyservice.DefaultCacheLockingManag
er.useCache(DefaultCacheLockingManager.java:77)
        at org.gradle.api.internal.artifacts.ivyservice.CacheLockingArtifactDepe
ndencyResolver.resolve(CacheLockingArtifactDependencyResolver.java:37)
        at org.gradle.api.internal.artifacts.ivyservice.SelfResolvingDependencyR
esolver.resolve(SelfResolvingDependencyResolver.java:41)
        at org.gradle.api.internal.artifacts.ivyservice.ShortcircuitEmptyConfigs
ArtifactDependencyResolver.resolve(ShortcircuitEmptyConfigsArtifactDependencyRes
olver.java:46)
        at org.gradle.api.internal.artifacts.ivyservice.ErrorHandlingArtifactDep
endencyResolver.resolve(ErrorHandlingArtifactDependencyResolver.java:44)
        at org.gradle.api.internal.artifacts.ivyservice.DefaultConfigurationReso
lver.resolve(DefaultConfigurationResolver.java:42)
        at org.gradle.api.internal.artifacts.configurations.DefaultConfiguration
.resolveNow(DefaultConfiguration.java:240)
        at org.gradle.api.internal.artifacts.configurations.DefaultConfiguration
.getResolvedConfiguration(DefaultConfiguration.java:230)
        at org.gradle.api.internal.artifacts.configurations.DefaultConfiguration
_Decorated.getResolvedConfiguration(Unknown Source)
        at org.gradle.api.internal.artifacts.configurations.DefaultConfiguration
$ConfigurationFileCollection.getFiles(DefaultConfiguration.java:463)
        ... 36 more


BUILD FAILED

Total time: 7.864 secs

C:UsersAdrian-PCAndroidStudioProjectsClujTourist>

Auch versucht, die .gradle und gradle Dateien von meinem Projekt zu löschen . Nichts scheint zu funktionieren.

EDIT Was scheint zu sein, für mich so weit funktioniert, ersetzen Sie die Service -Verzeichnis .gradle, um die Root-Verzeichnis, wie es scheint, dass es vielleicht ein Problem Pfad zu diesem Verzeichnis haben . Lassen Sie mich wissen, wenn Sie diese lösen es für Sie!

---

Top 5 Antwort

1Maziar Bouali @

Ich hatte genau das gleiche Problem .

Zu lösen, dass nur ein weiteres Projekt erstellen im Android Studio 0.5.2 und danach, wenn neue Projekt vollständig Erstellt und Einbauschränke in der Nähe ist und öffnen Sie Ihr altes Projekt ( Projekt " ClujTourist ') . Jetzt können Sie ClueTourist erfolgreich aufzubauen.

Bitte lassen Sie mich wissen, wenn etwas schief geht .

2Matt Logan @

Easy fix!

Die defaultConfig Teil Ihrer Datei build.gradle muss nach innen zu gehen buildTypes, wie folgt aus:

apply plugin: 'android'

android {
    compileSdkVersion 19
    buildToolsVersion "19.0.3"


    buildTypes {
        defaultConfig {
            minSdkVersion 8
            targetSdkVersion 19
            versionCode 1
            versionName "1.0"
        }

        release {
            runProguard false
            proguardFiles getDefaultProguardFile('proguard-android.txt'), 'proguard-rules.txt'
        }
    }
}

dependencies {
    compile 'com.android.support:appcompat-v7:+'
    compile fileTree(dir: 'libs', include: ['*.jar'])
}

Siehe die Führung für http://tools.android.com/tech-docs/new-build-system/migrating_to_09 .

Darüber hinaus stellen Sie sicher, mit dem up -to-date Gradle Verteilung url ( wenn Sie die Gradle Wrapper sind ) sind .

In Ihrer Datei gradle-wrapper.properties sollte die folgende Zeile sein :

distributionUrl=http://services.gradle.org/distributions/gradle-1.11-all.zip

Schließlich stellen Sie sicher, clean Ihr Projekt vor dem erneuten Aufbau (Build - > Rein Project) .

3lei jia @

In meinem Fall habe ich diese zwei Lösungen vor versucht, aber keiner konnte das Problem zu lösen, schließlich habe ich meine AVAST Sicherheitssoftwareheruntergefahren ... dann Es hat funktioniert! Gradle Sync ist ok .. Obwohl ich weiß nicht, warum, aber das Herunterfahren AVAST habe das Problem zu lösen .